Antennetechnologie
usage note: Antennetechnologie wordt vermeld in het attest, maximaal 1 antennetechnologie per attest
usage note: TO DO
comment: Geeft aan welke technologie(2G, 3G, 4G, 5G, microwave en andere) voor de antenne gebruikt is..
type: Class

Aannemer
usage note: TO DO
usage note: dient om gebruikt te worden door de operator, doet de aanvraag in naam van operator
comment: De aannemer is het bedrijf dat i.o. van een operator het dossier opmaakt, indient en betaalt. Dit is een keuzelijst
subclass of: Organization
type: Class

Site
usage note: per site slechts 1 geldig attest per operator
usage note: TO DO
comment: polygoon (geografische zone) per operator, waarbinnen de antennes zich bevinden
subclass of: Location
type: Class

vlakwinstverlies
usage note: gebruikt om de straling te berekenen
comment: TO DO
comment: de demping van de straling,afhankelijk van de hoek ten opzichte van de antenne
range: Literal
type: DatatypeProperty

gedempte straling
comment: Straling die het resultaat is van ongedempte straling van de antenne, gemodifieerd door de dempende maatregel
range: Gedempte Straling
domain: Demping
sub property of: generated
type: ObjectProperty

Goedkeuren van een conformiteitsattest
usage note: verwijst naar handeling van de beheerder
usage note: Het verlenen van een conformiteitsattest op een bepaald tijdstip. Vanaf dan is het conformiteitsattest geldig.
comment: Het verlenen van een conformiteitsattest op een bepaald tijdstip. Vanaf dan is het conformiteitsattest geldig.
subclass of: Activity
type: Class

antennetechnologie
range: Antennetechnologie
usage note: antennetechnologie wordt vermeld in het attest, maximaal 1 antennetechnologie per attest
usage note: TO DO
comment: TO DO
comment: Geeft aan welke technologie(2G, 3G, 4G, 5G, microwave en andere) voor de antenne gebruikt is.
type: ObjectProperty
domain: Zendantenne

Antennetype
usage note: De eigenschappen van het antennetype (naam, stralingstype, hoogte, breedte, horizontale- en verticale openingshoek, winst en winstverliezen) hebben invloed op de berekeningen en de weergave van het horizontaal en verticaal patroon. Eigenschappen van het antennetype hebben invloed op de berekeningen en de weergave van het horizontaal en verticaal patroon.
usage note: TO DO
comment: categorie van de antenne zoals die voorkomt in de tool, waaraan verschillende kenmerken aan vast hangen
subclass of: Entity
type: Class

is antennewinstverlies van
domain: Antennewinstverlies
usage note: TO DO
range: Antennetype
type: ObjectProperty
comment: de factor waarmee het zendvermogen van een antenne verminderd wordt als gevolg van de winstverliezen uit het stralingspatroon
usage note: Om de straling te berekenen
comment: TO DO

stralingstype
usage note: wordt gebruikt als input voor de keuze van de rekenmethode
usage note: TO DO
comment: Kenmerk dat de bundeling van de straling weergeeft en een relatie heeft met de rekenmethode die moet gebruikt worden
comment: TO DO
range: Concept
type: ObjectProperty

werd uitgevoerd door
usage note: gebruikt om de straling te berekenen
usage note: legt een relatie tussen de activiteit Demping en de maatregel die de demping van de straling verwezenlijkt
comment: legt een relatie tussen de activiteit Demping en de maatregel die de demping van de straling verwezenlijkt
range: Dempende maatregel
domain: Demping
sub property of: wasAssociatedWith
type: ObjectProperty

Gecontroleerde Ruimte
usage note: Verwijst naar een handeling van de dossierbehandelaar
usage note: TO DO
comment: checkbox: ruimte door dossierbehandelaar nagekeken
subclass of: Entity
type: Class

Antenneaanpassing
usage note: TO DO
usage note: antenne aanpassen in een dossier
comment: Verwijdering, toevoeging of een wijziging van een bestaande antenne
subclass of: Activity
type: Class

ligt binnen de maximale invloedsfeer van
comment: zone waar de stralingsnorm tegen afgetoetst worden
type: ObjectProperty
sub property of: wasInfluencedBy
comment: TO DO
usage note: TO DO
range: Zendantenne
domain: Gecontroleerde Ruimte

grb uidn
comment: identificator van de toestand van het object, verwijst naar het grb
comment: TO DO
range: Literal
type: DatatypeProperty

Intrekken van een conformiteitsattest
usage note: verwijst naar handeling van de beheerder
usage note: Het intrekken van een conformiteitsattest op een bepaald tijdstip. Vanaf dan is het conformiteitsattest niet meer geldig.
comment: Het intrekken van een conformiteitsattest op een bepaald tijdstip. Vanaf dan is het conformiteitsattest niet meer geldig.
subclass of: Activity
type: Class

niscode
usage note: legt relatie met gemeente waar het dossier over gaat
usage note: TO DO
comment: TO DO
comment: legt relatie met gemeente waar het dossier over gaat
range: Concept
type: ObjectProperty

Antenne winst
comment: een maat voor de versterking van een antenne (in dBi). De versterking wordt meestal opgegeven ten opzichte van zogenaamde isotrope straler.
comment: In electromagnetics, an antenna's power gain or simply gain is a key performance number which combines the antenna's directivity and electrical efficiency. As a transmitting antenna, the gain describes how well the antenna converts input power into radio waves headed in a specified direction. As a receiving antenna, the gain describes how well the antenna converts radio waves arriving from a specified direction into electrical power. When no direction is specified, "gain" is understood to refer to the peak value of the gain. A plot of the gain as a function of direction is called the radiation pattern. Antenna gain is usually defined as the ratio of the power produced by the antenna from a far-field source on the antenna's beam axis to the power produced by a hypothetical lossless isotropic antenna, which is equally sensitive to signals from all directions. Usually this ratio is expressed in decibels, and these units are referred to as "decibels-isotropic" (dBi). An alternative definition compares the antenna to the power received by a lossless half-wave dipole antenna, in which case the units are written as dBd. Since a lossless dipole antenna has a gain of 2.15 dBi, the relation between these units is: gain in dBd = gain in dBi − 2.15. For a given frequency, the antenna's effective area is proportional to the power gain. An antenna's effective length is proportional to the square root of the antenna's gain for a particular frequency and radiation resistance. Due to reciprocity, the gain of any antenna when receiving is equal to its gain when transmitting. Directive gain or directivity is a different measure which does not take an antenna's electrical efficiency into account. This term is sometimes more relevant in the case of a receiving antenna where one is concerned mainly with the ability of an antenna to receive signals from one direction while rejecting interfering signals coming from a different direction. @en
type: DatatypeProperty
label: Antenna gain @en
comment: In electromagnetics, an antenna's power gain or simply gain is a key performance number which combines the antenna's directivity and electrical efficiency. As a transmitting antenna, the gain describes how well the antenna converts input power into radio waves headed in a specified direction. As a receiving antenna, the gain describes how well the antenna converts radio waves arriving from a specified direction into electrical power. When no direction is specified, gain is understood to refer to the peak value of the gain. A plot of the gain as a function of direction is called the radiation pattern. Antenna gain is usually defined as the ratio of the power produced by the antenna from a far-field source on the antenna's beam axis to the power produced by a hypothetical lossless isotropic antenna, which is equally sensitive to signals from all directions. Usually this ratio is expressed in decibels, and these units are referred to as decibels-isotropic (dBi). An alternative definition compares the antenna to the power received by a lossless half-wave dipole antenna, in which case the units are written as dBd. Since a lossless dipole antenna has a gain of 2.15 dBi, the relation between these units is: gain in dBd = gain in dBi 2.15. For a given frequency, the antenna's effective area is proportional to the power gain. An antenna's effective length is proportional to the square root of the antenna's gain for a particular frequency and radiation resistance. Due to reciprocity, the gain of any antenna when receiving is equal to its gain when transmitting. Directive gain or directivity is a different measure which does not take an antenna's electrical efficiency into account. This term is sometimes more relevant in the case of a receiving antenna where one is concerned mainly with the ability of an antenna to receive signals from one direction while rejecting interfering signals coming from a different direction. @en
label: Antenna winst
range: Literal
usage note: gebruikt om de straling te berekenen en geeft de bundeling van de straling weer van een antenne

Dempingsfactor
usage note: TO DO
usage note: Verwijst naar de sterkte van de demping
comment: grootte van de demping
subclass of: Entity
type: Class

dempend materiaal
usage note: TO DO
comment: materiaal met een specifieke demping. Dit worden toegekend aan gebouwen en ruimtes
range: Concept
type: ObjectProperty

Dempende maatregel
usage note: Het nemen van een dempende maatregel waarbij gebruik gemaakt wordt van een dempend materiaal met een bepaalde frequentie-afhankelijke dempingsfactor
usage note: Dit is één van de mogelijk te nemen acties waarmee de invloed van straling door een zendantenne op een gecontroleerde ruimte kan worden beïnvloed.
comment: Het nemen van een dempende maatregel waarbij gebruik gemaakt wordt van een dempend materiaal met een bepaalde frequentie-afhankelijke dempingsfactor
comment: Dit is een van de mogelijk te nemen acties waarmee de invloed van straling door een zendantenne op een gecontroleerde ruimte kan worden beïnvloed.
subclass of: Agent
type: Class

oorspronkelijke straling
comment: de straling voordat er aanpassingen zoals demping worden toegepast
range: Straling
domain: Demping
sub property of: used
type: ObjectProperty

status
usage note: om te weten wat er met het dossier moet gebeuren, welke volgende stap nodig is om uiteindelijk tot goedgekeurd dossier te komen
usage note: TO DO
comment: toestand waain het dossier zich bevindt; mogelijke statussen zijn te behandelen, behandeld, in opmaak, ...
comment: TO DO
range: Concept
type: ObjectProperty

Antennewinstverlies
usage note: is gelinkt aan het antennetype
usage note: TO DO
comment: toont de horizontale en verticale winstverliezen van een antenne, per graad. Deze tabel gebruikt de tool in zijn berekening
type: Class

contactpersoon
usage note: TO DO
comment: TO DO
range: Person
type: ObjectProperty

antennetype
comment: categorie van de antenne zoals die voorkomt in de tool, waaraan verschillende kenmerken aan vast hangen
comment: TO DO
range: Antennetype
type: ObjectProperty
usage note: Een antenne verwijst naar haar eigenschappen
usage note: De eigenschappen van het antennetype (naam, stralingstype, hoogte, breedte, horizontale- en verticale openingshoek, winst en winstverliezen) hebben invloed op de berekeningen en de weergave van het horizontaal en verticaal patroon.
domain: Zendantenne
sub property of: wasInfluencedBy

basis
usage note: verwijst naar een kenmerk van een gebouw of ruimte
usage note: TO DO
comment: TO DO
comment: Grondvlak met een bepaalde basishoogte
range: Literal
type: DatatypeProperty

publiek zichtbaar
usage note: voor gevoelige dossiers (b.v. militaire installaties) wordt hier een "neen"-waarde ingegeven
comment: bepaalt of de attesten toegankelijk zijn voor het publiek via de website
range: Literal
type: DatatypeProperty

antennewinstverlies
usage note: is gelinkt aan het antennetype
domain: Antennetype
range: Antennewinstverlies
usage note: TO DO
type: ObjectProperty
comment: TO DO
comment: toont de horizontale en verticale winstverliezen van een antenne, per graad. Deze tabel gebruikt de tool in zijn berekening

rekenmethode
usage note: Handeling op basis van kenmerken van de antenne aan de hand van vaste rekenformules. Bepaalt de blootstelling in het dossier
usage note: TO DO
comment: de berekeningsmethode uitgevoerd door de tool, gebruikt om de straling te berekenen
comment: TO DO
range: Concept
type: ObjectProperty

Gedempte Straling
type: Class
usage note: verwijst naar kenmerk van de straling
subclass of: Straling
comment: Straling die het resultaat is van ongedempte straling van de antenne, gemodifieerd door de dempende maatregel
subclass of: Entity
usage note: Straling die het resultaat is van ongedempte straling van de antenne, gemodifieerd door de dempende maatregel

Verwijderde site
usage note: Wordt gebruikt om aan te geven dat de site verwijderd is, en dus niet meer mag teruggevonden worden als er naar sites wordt gezocht.
comment: Verwijderde sites. Het verschil met gedeactiveerde sites is dat gedeactiveerde sites wel nog gevonden worden wanneer er op sites gezocht wordt. Dit concept is ingevoerd om reeds samengevoegde site opnieuw te kunnen opsplisten. De oorspronkelijke sites werden vervangen door de samengevoegde site, maar na het opspliten van die samengevoegde site, is die samengevoegde site niet meer nodig. Verwijderen kan echter niet omwille van database constraints.
range: Literal
type: DatatypeProperty

elektrische tilt
usage note: TO DO
comment: TO DO
comment: de hoek ten opzichte van het horizontale vlak waarin de zendantenne het meeste vermogen uitzendt zonder dat de antenne fysiek getilt is.
range: Literal
type: DatatypeProperty
usage note: verwijst naar een invulveld dat een kenmerk van de antenne beschrijft en in het attest wordt vermeld

grb oidn
comment: identificator van het object, verwijst naar het grb
comment: TO DO
range: Literal
type: DatatypeProperty

Stralen
usage note: TO DO
usage note: Legt relatie tussen antenne en straling
comment: activiteit die straling creëert uit de antenne
subclass of: Activity
type: Class

Straling
usage note: TO DO
usage note: om te kijken of er niet teveel straling in de omgeving terecht komen door het aftoetsen aan een normen
comment: gevolg van de antenne die uitstraalt
subclass of: Entity
type: Class

Conformiteitsattest
usage note: TO DO
usage note: Vooraleer een antenne-eigenaar zendantennes in gebruik mag nemen, moet hij een conformiteitsattest krijgen van de Vlaamse overheid. Om dat aan te vragen moet de antenne-eigenaar een technisch dossier opmaken. Dat bevat de technische eigenschappen van de antennes zoals zendvermogen en de kenmerken van de omgeving zoals de hoogte van de gebouwen in de buurt van de antennes. Daarmee toont de antenne-eigenaar aan dat de antennes de norm respecteren. De Vlaamse overheid controleert vervolgens het technisch dossier. Als het dossier in orde is, bezorgt de Vlaamse overheid het conformiteitsattest aan de antenne-eigenaar en tegelijk ook aan de gemeente waar de antenne gelegen is. @en
comment: Vooraleer een antenne-eigenaar zendantennes in gebruik mag nemen, moet hij een conformiteitsattest krijgen van de Vlaamse overheid. Om dat aan te vragen moet de antenne-eigenaar een technisch dossier opmaken. Dat bevat de technische eigenschappen van de antennes zoals zendvermogen en de kenmerken van de omgeving zoals de hoogte van de gebouwen in de buurt van de antennes. Daarmee toont de antenne-eigenaar aan dat de antennes de norm respecteren. De Vlaamse overheid controleert vervolgens het technisch dossier. Als het dossier in orde is, bezorgt de Vlaamse overheid het conformiteitsattest aan de antenne-eigenaar en tegelijk ook aan de gemeente waar de antenne gelegen is. @en
comment: PDF afgeleverd na goedkeuring van het technisch dossier, bevat antenne-eigenschappen en informatie over de omgeving, en informatie over de exploitant van de antennes
subclass of: Besluit
type: Class

datum revisie
usage note: verwijst naar de datum waarop sites hernoemd zijn
comment: Toegevoegd aan het vocabularium om het hernoemen van sites te verduidelijken. Sites werden voorheen benoemd met een databank id, eigen aan het dossier. Over dossiers heen waren er in werkelijkheid gedeelde sites. Er is een gemeenschappelijke identifier voor deze gedeelde sites aangemaakt, aangeduide als prov:wasRevisionOf de oorspronkelijke site.
range: Literal
type: DatatypeProperty

Basis
sub property of: hoogte
range: Waarde
usage note: bvb een gebouw heeft als basis 0 en als hoogte 8, maar daar bovenop is een dakterras, dat wordt dan een vrije 3D ruimte met als basis 8 en als hoogte bvb 2,40 m en in die 3D ruimte moet dan ook de binnennorm afgechecked worden omdat daar een terras is.
type: ObjectProperty
comment: Hoogte waarop de basis zich bevindt ten opzichte van een nulpunt
comment: De hoogte van het grondvlak
usage note: verwijst naar een kenmerk van een gebouw of ruimte

Operator
usage note: om aan te geven wie de antenne zal exploiteren
usage note: TO DO
comment: exploitant die de straling veroorzaakt
subclass of: Agent
type: Class

normtype
usage note: verwijst naar welke norm getoetst moet worden, afhankelijk ruimte
usage note: TO DO
comment: Soort stralingsnorm waartegen afgetoetst wordt, afhankelijk van de ruimte: gebouw, 3D-ruimte. Mogelijke normen zijn: norm per antenne, cumulatieve norm
comment: TO DO
range: Concept
type: ObjectProperty

groot Antennetype
comment: De kostprijs van het dossier is
range: Literal
type: DatatypeProperty

Demping
usage note: verwijst naar een kenmerk van een gebouw of ruimte
usage note: TO DO
comment: verzwakking straling met een dempingsfactor
subclass of: Activity
type: Class

Zendantenne
subclass of: Agent
usage note: TO DO
usage note: gebruikt om aan te duiden in het dossier wat straling veroorzaakt
subclass of: Device
comment: een agent (device) die straalt
type: Class